{"text_format":"1","workbook":"xlsx","n_sheets":5,"sheets":["STP Spend per head calc","STP Weighted population calc","Sources","CCG Weighted Population","CCG - STP lookup"],"not_rendered":{"charts":0,"images":0,"macros":0,"external_links":0,"defined_names":0,"comments":0,"pivot_tables":0},"unopened":[],"bounds":{"document_bytes":16777216,"sheet_cells":100000,"rows_first":2000,"rows_last":500,"rows_between":2000,"halvings":0,"cell_chars":16384,"cell_head_chars":4096},"cells_cut":0,"cells_raw":0,"read":"whole","date_system":"1900"}

{"sheet":"STP Spend per head calc","index":0,"n_rows":43,"n_cols":5,"rows_kept":43,"cut":false,"hidden":false,"merged":[]}
["STP","STP population","Planned MH spend 2018/19 [1]","Planned MH spend as % of base allocations [2]","STP spend per head on MH"]
["South Yorkshire and Bassetlaw",1603622.6356331902,353805859.83249998,0.16600000000000001,{"$f":"Table3[[#This Row],[Planned MH spend 2018/19 '[1']]]/Table3[[#This Row],[STP population]]","v":220.62912556282282}]
["Cornwall and the Isles of Scilly",599303.20740144246,124637000,0.161,{"$f":"Table3[[#This Row],[Planned MH spend 2018/19 '[1']]]/Table3[[#This Row],[STP population]]","v":207.96985309059437}]
["North Central London",1523650.943418425,312513265.96745801,0.157,{"$f":"Table3[[#This Row],[Planned MH spend 2018/19 '[1']]]/Table3[[#This Row],[STP population]]","v":205.10817606709256}]
["Coventry and Warwickshire",961446.98397556017,196686272,0.16600000000000001,{"$f":"Table3[[#This Row],[Planned MH spend 2018/19 '[1']]]/Table3[[#This Row],[STP population]]","v":204.57318529068237}]
["Birmingham and Solihull",1295062.0853851782,263884000,0.16200000000000001,{"$f":"Table3[[#This Row],[Planned MH spend 2018/19 '[1']]]/Table3[[#This Row],[STP population]]","v":203.76165975202298}]
["Cumbria and North East",3793912.527149423,770281298.60624301,0.16400000000000001,{"$f":"Table3[[#This Row],[Planned MH spend 2018/19 '[1']]]/Table3[[#This Row],[STP population]]","v":203.03085353024682}]
["Norfolk and Waveney",1062780.4479337935,210162770.42402041,0.157,{"$f":"Table3[[#This Row],[Planned MH spend 2018/19 '[1']]]/Table3[[#This Row],[STP population]]","v":197.74805871956784}]
["Nottinghamshire",1064279.9037606653,208830000,0.155,{"$f":"Table3[[#This Row],[Planned MH spend 2018/19 '[1']]]/Table3[[#This Row],[STP population]]","v":196.2171786407813}]
["Lancashire and South Cumbria",1681465.3716138999,329804108.71064001,0.13400000000000001,{"$f":"Table3[[#This Row],[Planned MH spend 2018/19 '[1']]]/Table3[[#This Row],[STP population]]","v":196.14088656139748}]
["Dorset",839480.36770545447,163872707.25999999,0.155,{"$f":"Table3[[#This Row],[Planned MH spend 2018/19 '[1']]]/Table3[[#This Row],[STP population]]","v":195.20731343356135}]
["Humber, Coast and Vale",1423408.6409753952,276908339.80199999,0.151,{"$f":"Table3[[#This Row],[Planned MH spend 2018/19 '[1']]]/Table3[[#This Row],[STP population]]","v":194.53889194620012}]
["Devon",1245914.9052711516,240830619.38999999,0.14899999999999999,{"$f":"Table3[[#This Row],[Planned MH spend 2018/19 '[1']]]/Table3[[#This Row],[STP population]]","v":193.2962021492049}]
["Leicester, Leicestershire and Rutland",1007698.50815857,193638495.98199999,0.153,{"$f":"Table3[[#This Row],[Planned MH spend 2018/19 '[1']]]/Table3[[#This Row],[STP population]]","v":192.15915714299075}]
["Staffordshire and Stoke on Trent",1164719.6119256094,221597049.76449999,0.151,{"$f":"Table3[[#This Row],[Planned MH spend 2018/19 '[1']]]/Table3[[#This Row],[STP population]]","v":190.25785046938265}]
["North West London",2172133.4037589701,406504715.26269996,0.14000000000000001,{"$f":"Table3[[#This Row],[Planned MH spend 2018/19 '[1']]]/Table3[[#This Row],[STP population]]","v":187.14537263651766}]
["Lincolnshire",802412.26857000205,146574000,0.14499999999999999,{"$f":"Table3[[#This Row],[Planned MH spend 2018/19 '[1']]]/Table3[[#This Row],[STP population]]","v":182.66669858028592}]
["South East London",1956303.1144570503,354659690.662,0.14499999999999999,{"$f":"Table3[[#This Row],[Planned MH spend 2018/19 '[1']]]/Table3[[#This Row],[STP population]]","v":181.29076626268713}]
["West Yorkshire",2674534.5406828099,483230446.43299997,0.14099999999999999,{"$f":"Table3[[#This Row],[Planned MH spend 2018/19 '[1']]]/Table3[[#This Row],[STP population]]","v":180.67833452232441}]
["The Black Country and West Birmingham",1493614.9347897507,264767917.92605001,0.14099999999999999,{"$f":"Table3[[#This Row],[Planned MH spend 2018/19 '[1']]]/Table3[[#This Row],[STP population]]","v":177.2665174664447}]
["Milton Keynes, Bedfordshire and Luton",947194.36051482102,164909000,0.14099999999999999,{"$f":"Table3[[#This Row],[Planned MH spend 2018/19 '[1']]]/Table3[[#This Row],[STP population]]","v":174.1025990804763}]
["Bristol, North Somerset and South Gloucestershire",933151.82153531711,161293288,0.13600000000000001,{"$f":"Table3[[#This Row],[Planned MH spend 2018/19 '[1']]]/Table3[[#This Row],[STP population]]","v":172.84785206186891}]
["Northamptonshire",732049.51060180366,125337984.05599999,0.13900000000000001,{"$f":"Table3[[#This Row],[Planned MH spend 2018/19 '[1']]]/Table3[[#This Row],[STP population]]","v":171.21517361983081}]
["Derbyshire",1073869.4987520333,182782916.484,0.13200000000000001,{"$f":"Table3[[#This Row],[Planned MH spend 2018/19 '[1']]]/Table3[[#This Row],[STP population]]","v":170.20961736637079}]
["Hampshire and the Isle of Wight",1837886.0110291082,308755666.11430001,0.13400000000000001,{"$f":"Table3[[#This Row],[Planned MH spend 2018/19 '[1']]]/Table3[[#This Row],[STP population]]","v":167.99500309674536}]
["Cheshire and Merseyside",2942004.3803654197,490942347.84595001,0.13,{"$f":"Table3[[#This Row],[Planned MH spend 2018/19 '[1']]]/Table3[[#This Row],[STP population]]","v":166.87342517993503}]
["South West London",1498827.9694289153,249191083.88695002,0.13,{"$f":"Table3[[#This Row],[Planned MH spend 2018/19 '[1']]]/Table3[[#This Row],[STP population]]","v":166.257295012914}]
["Suffolk and North East Essex",1016634.1852733488,168987568.8531,0.13400000000000001,{"$f":"Table3[[#This Row],[Planned MH spend 2018/19 '[1']]]/Table3[[#This Row],[STP population]]","v":166.22259146997231}]
["Herefordshire and Worcestershire",754655.06680601195,124248805.249,0.13100000000000001,{"$f":"Table3[[#This Row],[Planned MH spend 2018/19 '[1']]]/Table3[[#This Row],[STP population]]","v":164.64317370168644}]
["North East London",2008990.01963854,330283654.62839001,0.128,{"$f":"Table3[[#This Row],[Planned MH spend 2018/19 '[1']]]/Table3[[#This Row],[STP population]]","v":164.40283495674859}]
{"$rows_left_out":14}
{"sheet":"STP Weighted population calc","index":1,"n_rows":211,"n_cols":7,"rows_kept":211,"cut":false,"hidden":false,"merged":[[69,6,71,6],[137,7,141,7],[142,7,147,7],[136,6,141,6],[142,6,146,6],[109,6,111,6],[128,6,135,6],[121,6,127,6],[94,6,98,6],[86,6,93,6],[78,6,85,6],[72,6,77,6],[1,3,11,3],[12,3,17,3],[18,3,29,3],[30,3,41,3],[42,3,46,3],[72,3,77,3],[47,3,52,3],[53,3,54,3],[55,3,58,3],[59,3,62,3],[63,3,68,3],[69,3,71,3],[106,3,108,3],[109,3,111,3],[113,3,119,3],[136,3,147,3],[128,3,135,3],[197,3,203,3],[204,3,209,3],[121,3,127,3],[170,3,172,3],[173,3,175,3],[176,3,178,3],[179,3,183,3],[184,3,191,3],[192,3,196,3],[148,3,151,3],[152,3,154,3],[155,3,157,3],[158,3,161,3],[162,3,163,3],[165,3,169,3],[69,5,71,5],[1,5,11,5],[12,5,17,5],[18,5,29,5],[30,5,41,5],[42,5,46,5],[47,5,52,5],[53,5,54,5],[55,5,58,5],[59,5,62,5],[63,5,68,5],[78,5,85,5],[86,5,93,5],[94,5,98,5],[99,5,101,5],[103,5,104,5],[78,3,85,3],[86,3,93,3],[94,3,98,3],[99,3,101,3],[103,3,104,3],[136,5,147,5],[152,5,154,5],[148,5,151,5],[155,5,157,5],[128,5,135,5],[184,5,191,5],[192,5,196,5],[197,5,203,5],[204,5,209,5],[72,5,77,5],[162,5,163,5],[165,5,169,5],[170,5,172,5],[173,5,175,5],[176,5,178,5],[179,5,183,5],[158,5,161,5],[106,5,108,5],[109,5,111,5],[113,5,119,5],[121,5,127,5]]}
["CCG Current Name","CCG Amended (allowing for mergers)","CCG Weighted Population [3]","STP population","STP Code","STP Name [4]","Notes"]
["NHS Airedale, Wharfedale and Craven CCG","NHS Airedale, Wharfedale and Craven CCG",{"$f":"VLOOKUP('STP Weighted population calc'!$B2,CCGPopulation[],11,FALSE)","v":169233.6086988688},{"$f":"SUM(C2:C12)","v":2674534.5406828099},"E54000005","West Yorkshire"]
["NHS Bradford City CCG","NHS Bradford City CCG",{"$f":"VLOOKUP('STP Weighted population calc'!$B3,CCGPopulation[],11,FALSE)","v":113620.78093616433},null,"E54000005"]
["NHS Bradford Districts CCG","NHS Bradford Districts CCG",{"$f":"VLOOKUP('STP Weighted population calc'!$B4,CCGPopulation[],11,FALSE)","v":364067.79686030262},null,"E54000005"]
["NHS Calderdale CCG","NHS Calderdale CCG",{"$f":"VLOOKUP('STP Weighted population calc'!$B5,CCGPopulation[],11,FALSE)","v":214577.50609347003},null,"E54000005"]
["NHS Greater Huddersfield CCG","NHS Greater Huddersfield CCG",{"$f":"VLOOKUP('STP Weighted population calc'!$B6,CCGPopulation[],11,FALSE)","v":231822.35622900669},null,"E54000005"]
["NHS Harrogate and Rural District CCG","NHS Harrogate and Rural District CCG",{"$f":"VLOOKUP('STP Weighted population calc'!$B7,CCGPopulation[],11,FALSE)","v":152896.19008332907},null,"E54000005"]
["NHS North Kirklees CCG","NHS North Kirklees CCG",{"$f":"VLOOKUP('STP Weighted population calc'!$B8,CCGPopulation[],11,FALSE)","v":186710.64522624831},null,"E54000005"]
["NHS Wakefield CCG","NHS Wakefield CCG",{"$f":"VLOOKUP('STP Weighted population calc'!$B9,CCGPopulation[],11,FALSE)","v":394588.33899032755},null,"E54000005"]
["NHS Leeds CCG","NHS Leeds North CCG",{"$f":"VLOOKUP('STP Weighted population calc'!$B10,CCGPopulation[],11,FALSE)","v":204189.22583963128},null,"E54000005",null,"Merger: Leeds North, Leeds South and East, and Leeds West CCGs into Leeds CCG"]
["NHS Leeds CCG","NHS Leeds South and East CCG",{"$f":"VLOOKUP('STP Weighted population calc'!$B11,CCGPopulation[],11,FALSE)","v":307057.38240954699},null,"E54000005",null,"Merger: Leeds North, Leeds South and East, and Leeds West CCGs into Leeds CCG"]
["NHS Leeds CCG","NHS Leeds West CCG",{"$f":"VLOOKUP('STP Weighted population calc'!$B12,CCGPopulation[],11,FALSE)","v":335770.7093159142},null,"E54000005",null,"Merger: Leeds North, Leeds South and East, and Leeds West CCGs into Leeds CCG"]
["NHS East Riding of Yorkshire CCG","NHS East Riding of Yorkshire CCG",{"$f":"VLOOKUP('STP Weighted population calc'!$B13,CCGPopulation[],11,FALSE)","v":310609.78349735204},{"$f":"SUM(C13:C18)","v":1423408.6409753952},"E54000006","Humber, Coast and Vale"]
["NHS Hull CCG","NHS Hull CCG",{"$f":"VLOOKUP('STP Weighted population calc'!$B14,CCGPopulation[],11,FALSE)","v":308434.87640265346},null,"E54000006"]
["NHS North East Lincolnshire CCG","NHS North East Lincolnshire CCG",{"$f":"VLOOKUP('STP Weighted population calc'!$B15,CCGPopulation[],11,FALSE)","v":178366.21255807465},null,"E54000006"]
["NHS North Lincolnshire CCG","NHS North Lincolnshire CCG",{"$f":"VLOOKUP('STP Weighted population calc'!$B16,CCGPopulation[],11,FALSE)","v":177864.71512862534},null,"E54000006"]
["NHS Scarborough and Ryedale CCG","NHS Scarborough and Ryedale CCG",{"$f":"VLOOKUP('STP Weighted population calc'!$B17,CCGPopulation[],11,FALSE)","v":128160.99661691934},null,"E54000006"]
["NHS Vale of York CCG","NHS Vale of York CCG",{"$f":"VLOOKUP('STP Weighted population calc'!$B18,CCGPopulation[],11,FALSE)","v":319972.05677177064},null,"E54000006"]
["NHS Bolton CCG","NHS Bolton CCG",{"$f":"VLOOKUP('STP Weighted population calc'!$B19,CCGPopulation[],11,FALSE)","v":334724.21231981867},{"$f":"SUM(C19:C30)","v":3276942.5790034821},"E54000007","Greater Manchester"]
["NHS Bury CCG","NHS Bury CCG",{"$f":"VLOOKUP('STP Weighted population calc'!$B20,CCGPopulation[],11,FALSE)","v":213189.56593861774},null,"E54000007"]
["NHS Heywood, Middleton and Rochdale CCG","NHS Heywood, Middleton and Rochdale CCG",{"$f":"VLOOKUP('STP Weighted population calc'!$B21,CCGPopulation[],11,FALSE)","v":261232.84424406203},null,"E54000007"]
["NHS Oldham CCG","NHS Oldham CCG",{"$f":"VLOOKUP('STP Weighted population calc'!$B22,CCGPopulation[],11,FALSE)","v":266660.67890999548},null,"E54000007"]
["NHS Salford CCG","NHS Salford CCG",{"$f":"VLOOKUP('STP Weighted population calc'!$B23,CCGPopulation[],11,FALSE)","v":313157.57378532359},null,"E54000007"]
["NHS Stockport CCG","NHS Stockport CCG",{"$f":"VLOOKUP('STP Weighted population calc'!$B24,CCGPopulation[],11,FALSE)","v":338933.7662695843},null,"E54000007"]
["NHS Tameside and Glossop CCG","NHS Tameside and Glossop CCG",{"$f":"VLOOKUP('STP Weighted population calc'!$B25,CCGPopulation[],11,FALSE)","v":281192.88852296368},null,"E54000007"]
["NHS Trafford CCG","NHS Trafford CCG",{"$f":"VLOOKUP('STP Weighted population calc'!$B26,CCGPopulation[],11,FALSE)","v":243955.85099060135},null,"E54000007"]
["NHS Wigan Borough CCG","NHS Wigan Borough CCG",{"$f":"VLOOKUP('STP Weighted population calc'!$B27,CCGPopulation[],11,FALSE)","v":368954.55061238894},null,"E54000007"]
["NHS Manchester CCG","NHS Central Manchester CCG",{"$f":"VLOOKUP('STP Weighted population calc'!$B28,CCGPopulation[],11,FALSE)","v":220653.6385949339},null,"E54000007",null,"Merger: Central Manchester, North Manchester and South Manchester CCGs into Manchester CCG"]
["NHS Manchester CCG","NHS North Manchester CCG",{"$f":"VLOOKUP('STP Weighted population calc'!$B29,CCGPopulation[],11,FALSE)","v":245473.92424832867},null,"E54000007",null,"Merger: Central Manchester, North Manchester and South Manchester CCGs into Manchester CCG"]
["NHS Manchester CCG","NHS South Manchester CCG",{"$f":"VLOOKUP('STP Weighted population calc'!$B30,CCGPopulation[],11,FALSE)","v":188813.08456686433},null,"E54000007",null,"Merger: Central Manchester, North Manchester and South Manchester CCGs into Manchester CCG"]
{"$rows_left_out":182}
{"sheet":"Sources","index":2,"n_rows":4,"n_cols":2,"rows_kept":4,"cut":false,"hidden":false,"merged":[]}
["[1] ","Mental Health Five Year Forward View Dashboard Q1 2018/19: https://www.england.nhs.uk/publication/mental-health-five-year-forward-view-dashboard/"]
["[2]","Mental Health Five Year Forward View Dashboard Q1 2018/19: https://www.england.nhs.uk/publication/mental-health-five-year-forward-view-dashboard/"]
["[3] ","NHS England overall weighted CCG populations 2018-19: https://www.england.nhs.uk/publication/nhs-england-allocations-2016-17-to-2020-21-overall-weighted-populations-for-core-ccg-allocations/"]
["[4] ","ONS Clinical Commissioning Group to STPs (April 2018) Lookup in England: https://data.gov.uk/dataset/00b07fa3-610b-4a1d-8d1b-476a8d0f3387/clinical-commissioning-group-to-stps-april-2018-lookup-in-england"]

{"sheet":"CCG Weighted Population","index":3,"n_rows":212,"n_cols":12,"rows_kept":212,"cut":false,"hidden":true,"merged":[]}
["Clinical Commissioning Group","Total weighted populations 2015 populations","Shares of weighted populations","Column1","Total weighted populations uplifted by ONS population growth to 2016","Shares of weighted populations2","Column3","Total weighted populations uplifted by ONS population growth to 2017","Shares of weighted populations4","Column5","Total weighted populations uplifted by ONS population growth to 2018-19","Shares of weighted populations3"]
["NHS Eastern Cheshire CCG",206514.20214451282,3.6022529146023984E-3,null,207552.97797202974,3.5935018987083667E-3,null,208533.82591798509,3.5846737688998058E-3,null,209587.97019490247,3.5770619490374002E-3]
["NHS South Cheshire CCG",187157.01819041921,3.2646031472109345E-3,null,187841.11977760156,3.2522174683867091E-3,null,188561.16494151735,3.2413459007119816E-3,null,189232.09641790992,3.2296459143318942E-3]
["NHS Vale Royal CCG",108463.66401570103,1.8919451823250584E-3,null,108673.97989613314,1.881544446688578E-3,null,108908.81994780501,1.8721307603221703E-3,null,109135.56913103393,1.8626292876548726E-3]
["NHS Warrington CCG",221660.1551578638,3.8664456568942591E-3,null,223394.02774290615,3.8677684642155568E-3,null,225105.68694011957,3.869542256045206E-3,null,226810.49485878507,3.8710007547056958E-3]
["NHS West Cheshire CCG",274851.27633175929,4.7942649995346871E-3,null,275694.72816446371,4.7732850610141446E-3,null,276439.82871216408,4.7519705654534075E-3,null,277241.90814195253,4.7317194749816795E-3]
["NHS Wirral CCG",406847.42056179699,7.0966901612492406E-3,null,407638.87975454086,7.0577213716620365E-3,null,408476.67933399568,7.0216696556066318E-3,null,409345.87286864076,6.9863530071514E-3]
["NHS Darlington CCG",118631.1778013322,2.0692983899408724E-3,null,118848.72631459394,2.0577065568681886E-3,null,119055.48199835443,2.046550776520409E-3,null,119281.24416736301,2.0357866882728688E-3]
["NHS Durham Dales, Easington and Sedgefield CCG",344276.11603872414,6.0052511137255911E-3,null,345802.35448522202,5.9871047361600852E-3,null,347347.97141329857,5.970873820228627E-3,null,348902.45424833865,5.9547582423595041E-3]
["NHS North Durham CCG",265075.35212489998,4.6237423376479835E-3,null,266185.1064056824,4.6086386937103504E-3,null,267186.74539228919,4.5929110703706042E-3,null,268183.99333661393,4.5771270031061771E-3]
["NHS Hartlepool and Stockton-on-Tees CCG",327333.61644027557,5.7097209858922842E-3,null,329048.77676810283,5.6970389711449515E-3,null,330768.05785314308,5.6858669108311539E-3,null,332472.22101294168,5.6743415654600896E-3]
["NHS South Tees CCG",338086.97307563433,5.897293123204049E-3,null,338741.8404203839,5.8648613892047256E-3,null,339333.35867281148,5.8331034995996204E-3,null,339943.98661869083,5.8018630468485372E-3]
["NHS Bolton CCG",328610.46358348936,5.7319931894278305E-3,null,330661.03412237967,5.7249530484104732E-3,null,332690.63118272874,5.7189157370971747E-3,null,334724.21231981867,5.712776559634143E-3]
["NHS Bury CCG",209645.78406996644,3.6568774876396923E-3,null,210830.12116161498,3.65024124491857E-3,null,212004.76438375982,3.6443388233194252E-3,null,213189.56593861774,3.63853079707614E-3]
["NHS Central Manchester CCG",216181.36054144392,3.7708783609380434E-3,null,217854.25815367553,3.7718547715679387E-3,null,219287.78295309734,3.7695331197794262E-3,null,220653.6385949339,3.7659209820134262E-3]
["NHS Oldham CCG",263191.72945251776,4.5908860730853561E-3,null,264330.25416142988,4.5765244107611406E-3,null,265487.59410750883,4.5637028447355933E-3,null,266660.67890999548,4.551128420903155E-3]
["NHS Heywood, Middleton and Rochdale CCG",259193.54917351203,4.5211453171780424E-3,null,259851.12039829668,4.4989742072436703E-3,null,260518.53131781268,4.4782851962566102E-3,null,261232.84424406203,4.458490943517782E-3]
["NHS Salford CCG",303645.91546495585,5.2965334714623336E-3,null,306953.6452656007,5.3144913547134853E-3,null,310078.59645639954,5.3302173214415634E-3,null,313157.57378532359,5.3446962638106455E-3]
["NHS North Manchester CCG",239728.10962158476,4.1816072339285462E-3,null,241781.15031775233,4.1861168711143371E-3,null,243673.87257958221,4.1887273460651901E-3,null,245473.92424832867,4.1895316467497395E-3]
["NHS South Manchester CCG",184180.53676839743,3.2126840115466724E-3,null,185795.66453756156,3.2168031497841723E-3,null,187322.41266911069,3.2200518839858531E-3,null,188813.08456686433,3.2224945909654955E-3]
["NHS Stockport CCG",333969.92259094503,5.8254788995137138E-3,null,335585.42728308396,5.810212322191464E-3,null,337229.55925696774,5.7969394166370418E-3,null,338933.7662695843,5.784621500172114E-3]
["NHS Tameside and Glossop CCG",276265.87778211641,4.8189400685838555E-3,null,277906.97607335408,4.811587171341284E-3,null,279542.27883529221,4.8053013453723988E-3,null,281192.88852296368,4.7991513107362108E-3]
["NHS Trafford CCG",238756.15397159706,4.1646532906322769E-3,null,240487.0592657635,4.1637114173460462E-3,null,242200.88859912075,4.1634069117734099E-3,null,243955.85099060135,4.1636225161778943E-3]
["NHS Wigan Borough CCG",362664.63999774429,6.3260044243393741E-3,null,364737.93584466027,6.3149489725239588E-3,null,366832.84494381835,6.3058166753156217E-3,null,368954.55061238894,6.2969896730831936E-3]
["NHS Blackburn with Darwen CCG",182481.75925954341,3.1830520241628302E-3,null,182847.4960372143,3.1657595598187332E-3,null,183216.03976411285,3.1494637807221843E-3,null,183583.42078288624,3.1332393187734372E-3]
["NHS Blackpool CCG",214833.95047330455,3.7473753195262803E-3,null,214799.88953175698,3.7189724687001924E-3,null,214835.82439357293,3.6930044367309857E-3,null,214906.5715551918,3.6678351290548267E-3]
["NHS Chorley and South Ribble CCG",183380.67888791542,3.19873199104971E-3,null,184590.12401889465,3.1959308299305722E-3,null,185834.29650073501,3.1944713290309461E-3,null,187066.55126961868,3.1926863066708646E-3]
["NHS East Lancashire CCG",414816.73666642047,7.235699933299586E-3,null,415720.89290421782,7.1976506074770191E-3,null,416662.73183979635,7.1623870071403882E-3,null,417665.79764369712,7.1283501184552216E-3]
["NHS Greater Preston CCG",217520.79494838091,3.7942422818994263E-3,null,218077.996618034,3.7757285034909498E-3,null,218549.0566828881,3.756834495603904E-3,null,219062.09705521099,3.7387579598382454E-3]
["NHS Lancashire North CCG",165561.82843004283,2.8879155661734254E-3,null,166030.17062880844,2.874590088887572E-3,null,166470.851465449,2.8616158165596884E-3,null,166900.63818984633,2.8485123529932328E-3]
{"$rows_left_out":183}
{"sheet":"CCG - STP lookup","index":4,"n_rows":197,"n_cols":6,"rows_kept":197,"cut":false,"hidden":true,"merged":[[0,0,0,5]]}
["Source:"]
["CCG18CD","CCG18CDH","CCG18NM","STP18CD","STP18NM","FID"]
["E38000001","02N","NHS Airedale, Wharfedale and Craven CCG","E54000005","West Yorkshire",1]
["E38000018","02W","NHS Bradford City CCG","E54000005","West Yorkshire",2]
["E38000019","02R","NHS Bradford Districts CCG","E54000005","West Yorkshire",3]
["E38000025","02T","NHS Calderdale CCG","E54000005","West Yorkshire",4]
["E38000064","03A","NHS Greater Huddersfield CCG","E54000005","West Yorkshire",5]
["E38000073","03E","NHS Harrogate and Rural District CCG","E54000005","West Yorkshire",6]
["E38000121","03J","NHS North Kirklees CCG","E54000005","West Yorkshire",7]
["E38000190","03R","NHS Wakefield CCG","E54000005","West Yorkshire",8]
["E38000225","15F","NHS Leeds CCG","E54000005","West Yorkshire",9]
["E38000052","02Y","NHS East Riding of Yorkshire CCG","E54000006","Humber, Coast and Vale",10]
["E38000085","03F","NHS Hull CCG","E54000006","Humber, Coast and Vale",11]
["E38000119","03H","NHS North East Lincolnshire CCG","E54000006","Humber, Coast and Vale",12]
["E38000122","03K","NHS North Lincolnshire CCG","E54000006","Humber, Coast and Vale",13]
["E38000145","03M","NHS Scarborough and Ryedale CCG","E54000006","Humber, Coast and Vale",14]
["E38000188","03Q","NHS Vale of York CCG","E54000006","Humber, Coast and Vale",15]
["E38000016","00T","NHS Bolton CCG","E54000007","Greater Manchester",16]
["E38000024","00V","NHS Bury CCG","E54000007","Greater Manchester",17]
["E38000080","01D","NHS Heywood, Middleton and Rochdale CCG","E54000007","Greater Manchester",18]
["E38000135","00Y","NHS Oldham CCG","E54000007","Greater Manchester",19]
["E38000143","01G","NHS Salford CCG","E54000007","Greater Manchester",20]
["E38000174","01W","NHS Stockport CCG","E54000007","Greater Manchester",21]
["E38000182","01Y","NHS Tameside and Glossop CCG","E54000007","Greater Manchester",22]
["E38000187","02A","NHS Trafford CCG","E54000007","Greater Manchester",23]
["E38000205","02H","NHS Wigan Borough CCG","E54000007","Greater Manchester",24]
["E38000217","14L","NHS Manchester CCG","E54000007","Greater Manchester",25]
["E38000056","01C","NHS Eastern Cheshire CCG","E54000008","Cheshire and Merseyside",26]
["E38000068","01F","NHS Halton CCG","E54000008","Cheshire and Merseyside",27]
["E38000091","01J","NHS Knowsley CCG","E54000008","Cheshire and Merseyside",28]
{"$rows_left_out":167}